Reaction Details
TargetInterstitial collagenase
LigandBDBM50082957
Substrate/Competitorn/a
Meas. Tech.ChEMBL_105968 (CHEMBL715380)
IC50 1.2±n/a nM
Citation Barlaam, BBird, TGLambert-Van Der Brempt, CCampbell, DFoster, SJMaciewicz, R New alpha-substituted succinate-based hydroxamic acids as TNFalpha convertase inhibitors. J Med Chem42:4890-908 (1999) Interstitial collagenase
Name:Interstitial collagenase
Type:Enzyme
Mol. Mass.:54010.26
Organism:Homo sapiens (Human)
Description: P03956
Residue:469
BDBM50082957
NameBDBM50082957
Synonyms:(2R,3S)-N*1*-((S)-2,2-Dimethyl-1-methylcarbamoyl-propyl)-N*4*-hydroxy-2-isobutyl-3-(quinoline-6-sulfonylamino)-succinamide | CHEMBL344759
TypeSmall organic molecule
Emp. Form.C24H35N5O6S
Mol. Mass.521.63
SMILESCNC(=O)[C@@H](NC(=O)[C@H](CC(C)C)[C@H](NS(=O)(=O)c1ccc2ncccc2c1)C(=O)NO)C(C)(C)C