Reaction Details
TargetInterstitial collagenase
LigandBDBM50082963
Substrate/Competitorn/a
Meas. Tech.ChEMBL_105968 (CHEMBL715380)
IC50 1.3±n/a nM
Citation Barlaam, BBird, TGLambert-Van Der Brempt, CCampbell, DFoster, SJMaciewicz, R New alpha-substituted succinate-based hydroxamic acids as TNFalpha convertase inhibitors. J Med Chem42:4890-908 (1999) Interstitial collagenase
Name:Interstitial collagenase
Type:Enzyme
Mol. Mass.:54010.26
Organism:Homo sapiens (Human)
Description: P03956
Residue:469
BDBM50082963
NameBDBM50082963
Synonyms:(2R,3S)-N*1*-((S)-2,2-Dimethyl-1-methylcarbamoyl-propyl)-N*4*-hydroxy-2-isobutyl-3-(4-oxo-3,4-dihydro-quinazoline-6-sulfonylamino)-succinamide | CHEMBL342100
TypeSmall organic molecule
Emp. Form.C23H34N6O7S
Mol. Mass.538.617
SMILESCNC(=O)[C@@H](NC(=O)[C@H](CC(C)C)[C@H](NS(=O)(=O)c1ccc2nc[nH]c(=O)c2c1)C(=O)NO)C(C)(C)C