Reaction Details
TargetDelta-type opioid receptor
LigandBDBM50083169
Substrate/Competitorn/a
Meas. Tech.ChEMBL_146899 (CHEMBL751673)
Ki 0.08±n/a nM
Citation Salvadori, SGuerrini, RBalboni, GBianchi, CBryant, SDCooper, PSLazarus, LH Further studies on the Dmt-Tic pharmacophore: hydrophobic substituents at the C-terminus endow delta antagonists to manifest mu agonism or mu antagonism. J Med Chem42:5010-9 (2000) Delta-type opioid receptor
Name:Delta-type opioid receptor
Type:G Protein-Coupled Receptor (GPCR)
Mol. Mass.:40465.04
Organism:Rattus norvegicus (rat)
Description:Competition binding assays were using CHO-K1 cell membranes expressing the opioid receptor.
Residue:372
BDBM50083169
NameBDBM50083169
Synonyms:(S)-2-[(S)-2-Amino-3-(4-hydroxy-2,6-dimethyl-phenyl)-propionyl]-1,2,3,4-tetrahydro-isoquinoline-3-carboxylic acid ((S)-1-tert-butylcarbamoyl-ethyl)-amide | CHEMBL344106
TypeSmall organic molecule
Emp. Form.C28H38N4O4
Mol. Mass.494.6257
SMILESC[C@H](NC(=O)[C@@H]1Cc2ccccc2CN1C(=O)[C@@H](N)Cc1c(C)cc(O)cc1C)C(=O)NC(C)(C)C