Reaction Details
TargetProtein farnesyltransferase subunit beta/geranylgeranyltransferase type-1 subunit alpha
LigandBDBM50083575
Substrate/Competitorn/a
Meas. Tech.ChEMBL_70275 (CHEMBL681414)
IC50 0.450000±n/a nM
Citation Dinsmore, CJWilliams, TMO'Neill, TJLiu, DRands, ECulberson, JCLobell, RBKoblan, KSKohl, NEGibbs, JBOliff, AIGraham, SLHartman, GD Imidazole-containing diarylether and diarylsulfone inhibitors of farnesyl-protein transferase. Bioorg Med Chem Lett9:3301-6 (2000) Protein farnesyltransferase subunit beta/geranylgeranyltransferase type-1 subunit alpha
Name:Protein farnesyltransferase subunit beta/geranylgeranyltransferase type-1 subunit alpha
Type:Protein Complex
Mol. Mass.:n/a
Description:Purified bovine brain FTase.
Components:This complex has 2 components.
Component 1
Name:Protein farnesyltransferase/geranylgeranyltransferase type-1 subunit alpha
Synonyms:CAAX farnesyltransferase alpha subunit FNTA_BOVIN GGTase-I-alpha Protein Farnesyltransferase (PFT) Chain A Protein farnesyltransferase/geranylgeranyltransferase type I alpha subunit Type I protein geranyl-geranyltransferase alpha subunit
Type:Enzyme
Mol. Mass.:43827.38
Organism:Bos taurus (bovine)
Description:The enzyme was purified from a bovine brain homogenate by sequential ammonium sulfate fractionation and affinity chromatography.
Residue:375
Component 2
Name:Protein farnesyltransferase subunit beta
Synonyms:CAAX farnesyltransferase subunit beta FNTB_BOVIN Protein farnesyltransferase Protein farnesyltransferase subunit beta Ras proteins prenyltransferase subunit beta
Type:Enzyme Subunit
Mol. Mass.:48758.49
Organism:Bos taurus (bovine)
Description:Protein farnesyltransferase subunit beta
Residue:437
BDBM50083575
NameBDBM50083575
Synonyms:4-{5-[(4-Benzenesulfonyl-3-methyl-phenylamino)-methyl]-2-methyl-imidazol-1-ylmethyl}-benzonitrile | CHEMBL114086
TypeSmall organic molecule
Emp. Form.C26H24N4O2S
Mol. Mass.456.559
SMILESCc1ncc(CNc2ccc(c(C)c2)S(=O)(=O)c2ccccc2)n1Cc1ccc(cc1)C#N