Reaction Details
TargetDual specificity protein kinase TTK
LigandBDBM253941
Substrate/Competitorn/a
Meas. Tech.ChEMBL_1906418 (CHEMBL4408776)
Kd 4.2±n/a nM
Citation Sánchez-Martínez, CLallena, MJSanfeliciano, SGde Dios, A Cyclin dependent kinase (CDK) inhibitors as anticancer drugs: Recent advances (2015-2019). Bioorg Med Chem Lett29:0 (2019) 
 
Dual specificity protein kinase TTK
Name:Dual specificity protein kinase TTK
Type:Protein
Mol. Mass.:97086.79
Organism:Homo sapiens (Human)
Description:P33981
Residue:857
BDBM253941
NameBDBM253941
Synonyms:US9464092, GG | US9527857, GG
TypeSmall organic molecule
Emp. Form.C26H34N8O
Mol. Mass.474.6012
SMILESCC(C)N1CCN(CC1)c1ccc(Nc2ncc3cc4C(=O)NCC5(CCCCC5)n4c3n2)nc1