Reaction Details
TargetGlucocorticoid receptor
LigandBDBM50354849
Substrate/Competitorn/a
Meas. Tech.ChEMBL_71413 (CHEMBL685131)
IC50 0.500000±n/a nM
Citation Biggadike, KAngell, RMBurgess, CMFarrell, RMHancock, APHarker, AJIrving, WRIoannou, CProcopiou, PAShaw, RESolanke, YESingh, OMSnowden, MAStubbs, RJWalton, SWeston, HE Selective plasma hydrolysis of glucocorticoid gamma-lactones and cyclic carbonates by the enzyme paraoxonase: an ideal plasma inactivation mechanism. J Med Chem43:19-21 (2000) Glucocorticoid receptor
Name:Glucocorticoid receptor
Type:Enzyme
Mol. Mass.:85656.87
Organism:Homo sapiens (Human)
Description:P04150
Residue:777
BDBM50354849
NameBDBM50354849
Synonyms:CCI-18781 FLUTICASONE PROPIONATE Flovent Flovent diskus 250 Flovent hfa US10869929, Compound FLUTICASONE PROPIONATE
TypeSmall organic molecule
Emp. Form.C25H31F3O5S
Mol. Mass.500.571
SMILESCCC(=O)O[C@@]1([C@H](C)C[C@H]2[C@@H]3C[C@H](F)C4=CC(=O)C=C[C@]4(C)[C@@]3(F)[C@@H](O)C[C@]12C)C(=O)SCF