Reaction Details
TargetCannabinoid receptor 1
LigandBDBM50083851
Substrate/Competitorn/a
Meas. Tech.ChEMBL_46823 (CHEMBL657227)
Kd 25±n/a nM
Citation Keimowitz, ARMartin, BRRazdan, RKCrocker, PJMascarella, SWThomas, BF QSAR analysis of Delta(8)-THC analogues: relationship of side-chain conformation to cannabinoid receptor affinity and pharmacological potency. J Med Chem43:59-70 (2000) Cannabinoid receptor 1
Name:Cannabinoid receptor 1
Type:G Protein-Coupled Receptor (GPCR)
Mol. Mass.:52868.96
Organism:Homo sapiens (Human)
Description:P21554
Residue:472
BDBM50083851
NameBDBM50083851
Synonyms:3-(4-Bromo-pent-2-ynyl)-6,6,9-trimethyl-6a,7,10,10a-tetrahydro-6H-benzo[c]chromen-1-ol | CHEMBL159863
TypeSmall organic molecule
Emp. Form.C21H25BrO2
Mol. Mass.389.326
SMILESCC(Br)C#CCc1cc(O)c2C3CC(C)=CCC3C(C)(C)Oc2c1