Reaction Details
TargetCannabinoid receptor 1
LigandBDBM50083853
Substrate/Competitorn/a
Meas. Tech.ChEMBL_46821 (CHEMBL657225)
Kd 3.19±n/a nM
Citation Keimowitz, ARMartin, BRRazdan, RKCrocker, PJMascarella, SWThomas, BF QSAR analysis of Delta(8)-THC analogues: relationship of side-chain conformation to cannabinoid receptor affinity and pharmacological potency. J Med Chem43:59-70 (2000) Cannabinoid receptor 1
Name:Cannabinoid receptor 1
Type:G Protein-Coupled Receptor (GPCR)
Mol. Mass.:52868.96
Organism:Homo sapiens (Human)
Description:P21554
Residue:472
BDBM50083853
NameBDBM50083853
Synonyms:6,6,9-Trimethyl-3-oct-2-enyl-6a,7,10,10a-tetrahydro-6H-benzo[c]chromen-1-ol | CHEMBL159361
TypeSmall organic molecule
Emp. Form.C24H34O2
Mol. Mass.354.5256
SMILESCCCCC\C=C\Cc1cc(O)c2C3CC(C)=CCC3C(C)(C)Oc2c1