Reaction Details
TargetCannabinoid receptor 1
LigandBDBM50083854
Substrate/Competitorn/a
Meas. Tech.ChEMBL_46821 (CHEMBL657225)
Kd>10000±n/a nM
Citation Keimowitz, ARMartin, BRRazdan, RKCrocker, PJMascarella, SWThomas, BF QSAR analysis of Delta(8)-THC analogues: relationship of side-chain conformation to cannabinoid receptor affinity and pharmacological potency. J Med Chem43:59-70 (2000) Cannabinoid receptor 1
Name:Cannabinoid receptor 1
Type:G Protein-Coupled Receptor (GPCR)
Mol. Mass.:52868.96
Organism:Homo sapiens (Human)
Description:P21554
Residue:472
BDBM50083854
NameBDBM50083854
Synonyms:5-(1-Hydroxy-6,6,9-trimethyl-6a,7,10,10a-tetrahydro-6H-benzo[c]chromen-3-yl)-pent-2-ynoic acid methyl ester | CHEMBL159622
TypeSmall organic molecule
Emp. Form.C22H26O4
Mol. Mass.354.4394
SMILESCOC(=O)C#CCCc1cc(O)c2C3CC(C)=CCC3C(C)(C)Oc2c1