Reaction Details
TargetCannabinoid receptor 1
LigandBDBM50083864
Substrate/Competitorn/a
Meas. Tech.ChEMBL_46821 (CHEMBL657225)
Kd 5.34±n/a nM
Citation Keimowitz, ARMartin, BRRazdan, RKCrocker, PJMascarella, SWThomas, BF QSAR analysis of Delta(8)-THC analogues: relationship of side-chain conformation to cannabinoid receptor affinity and pharmacological potency. J Med Chem43:59-70 (2000) Cannabinoid receptor 1
Name:Cannabinoid receptor 1
Type:G Protein-Coupled Receptor (GPCR)
Mol. Mass.:52868.96
Organism:Homo sapiens (Human)
Description:P21554
Residue:472
BDBM50083864
NameBDBM50083864
Synonyms:6,6,9-Trimethyl-3-(6-nitro-hex-2-ynyl)-6a,7,10,10a-tetrahydro-6H-benzo[c]chromen-1-ol | CHEMBL160099
TypeSmall organic molecule
Emp. Form.C22H27NO4
Mol. Mass.369.4541
SMILESCC1=CCC2C(C1)c1c(O)cc(CC#CCCC[N+]([O-])=O)cc1OC2(C)C