Reaction Details
TargetCannabinoid receptor 1
LigandBDBM50083865
Substrate/Competitorn/a
Meas. Tech.ChEMBL_46825 (CHEMBL658059)
Kd 448.0±n/a nM
Citation Keimowitz, ARMartin, BRRazdan, RKCrocker, PJMascarella, SWThomas, BF QSAR analysis of Delta(8)-THC analogues: relationship of side-chain conformation to cannabinoid receptor affinity and pharmacological potency. J Med Chem43:59-70 (2000) Cannabinoid receptor 1
Name:Cannabinoid receptor 1
Type:G Protein-Coupled Receptor (GPCR)
Mol. Mass.:52868.96
Organism:Homo sapiens (Human)
Description:P21554
Residue:472
BDBM50083865
NameBDBM50083865
Synonyms:3-(5-Hydroxy-pent-2-ynyl)-6,6,9-trimethyl-6a,7,10,10a-tetrahydro-6H-benzo[c]chromen-1-ol | CHEMBL441100
TypeSmall organic molecule
Emp. Form.C21H26O3
Mol. Mass.326.4293
SMILESCC1=CCC2C(C1)c1c(O)cc(CC#CCCO)cc1OC2(C)C