Reaction Details
TargetCannabinoid receptor 1
LigandBDBM50083869
Substrate/Competitorn/a
Meas. Tech.ChEMBL_46823 (CHEMBL657227)
Kd 20.9±n/a nM
Citation Keimowitz, ARMartin, BRRazdan, RKCrocker, PJMascarella, SWThomas, BF QSAR analysis of Delta(8)-THC analogues: relationship of side-chain conformation to cannabinoid receptor affinity and pharmacological potency. J Med Chem43:59-70 (2000) Cannabinoid receptor 1
Name:Cannabinoid receptor 1
Type:G Protein-Coupled Receptor (GPCR)
Mol. Mass.:52868.96
Organism:Homo sapiens (Human)
Description:P21554
Residue:472
BDBM50083869
NameBDBM50083869
Synonyms:3-(6-Fluoro-hex-2-enyl)-6,6,9-trimethyl-6a,7,10,10a-tetrahydro-6H-benzo[c]chromen-1-ol | CHEMBL159662
TypeSmall organic molecule
Emp. Form.C22H29FO2
Mol. Mass.344.4629
SMILESCC1=CCC2C(C1)c1c(O)cc(C\C=C\CCCF)cc1OC2(C)C