Reaction Details
TargetCannabinoid receptor 1
LigandBDBM50083874
Substrate/Competitorn/a
Meas. Tech.ChEMBL_46821 (CHEMBL657225)
Kd 45±n/a nM
Citation Keimowitz, ARMartin, BRRazdan, RKCrocker, PJMascarella, SWThomas, BF QSAR analysis of Delta(8)-THC analogues: relationship of side-chain conformation to cannabinoid receptor affinity and pharmacological potency. J Med Chem43:59-70 (2000) Cannabinoid receptor 1
Name:Cannabinoid receptor 1
Type:G Protein-Coupled Receptor (GPCR)
Mol. Mass.:52868.96
Organism:Homo sapiens (Human)
Description:P21554
Residue:472
BDBM50083874
NameBDBM50083874
Synonyms:6,6,9-Trimethyl-6a,7,10,10a-tetrahydro-6H-benzo[c]chromen-1-ol | CHEMBL352094
TypeSmall organic molecule
Emp. Form.C16H20O2
Mol. Mass.244.3288
SMILESCC1=CCC2C(C1)c1c(O)cccc1OC2(C)C