Reaction Details
TargetCannabinoid receptor 1
LigandBDBM50083875
Substrate/Competitorn/a
Meas. Tech.ChEMBL_46823 (CHEMBL657227)
Kd 1300±n/a nM
Citation Keimowitz, ARMartin, BRRazdan, RKCrocker, PJMascarella, SWThomas, BF QSAR analysis of Delta(8)-THC analogues: relationship of side-chain conformation to cannabinoid receptor affinity and pharmacological potency. J Med Chem43:59-70 (2000) Cannabinoid receptor 1
Name:Cannabinoid receptor 1
Type:G Protein-Coupled Receptor (GPCR)
Mol. Mass.:52868.96
Organism:Homo sapiens (Human)
Description:P21554
Residue:472
BDBM50083875
NameBDBM50083875
Synonyms:3-(6-Amino-hex-2-ynyl)-6,6,9-trimethyl-6a,7,10,10a-tetrahydro-6H-benzo[c]chromen-1-ol | CHEMBL161273
TypeSmall organic molecule
Emp. Form.C22H29NO2
Mol. Mass.339.4712
SMILESCC1=CCC2C(C1)c1c(O)cc(CC#CCCCN)cc1OC2(C)C