Reaction Details
TargetKynurenine 3-monooxygenase
LigandBDBM50083940
Substrate/Competitorn/a
Meas. Tech.ChEMBL_91745 (CHEMBL700046)
IC50 320±n/a nM
Citation Drysdale, MJHind, SLJansen, MReinhard, JF Synthesis and SAR of 4-aryl-2-hydroxy-4-oxobut-2-enoic acids and esters and 2-amino-4-aryl-4-oxobut-2-enoic acids and esters: potent inhibitors of kynurenine-3-hydroxylase as potential neuroprotective agents. J Med Chem43:123-7 (2000) Kynurenine 3-monooxygenase
Name:Kynurenine 3-monooxygenase
Type:PROTEIN
Mol. Mass.:54371.88
Organism:Rattus norvegicus
Description:ChEMBL_1487468
Residue:478
BDBM50083940
NameBDBM50083940
Synonyms:4-(3-Chloro-phenyl)-2-hydroxy-4-oxo-but-2-enoic acid (0.2H2O) CHEMBL278763 | Sacchettini_6
TypeSmall organic molecule
Emp. Form.C10H7ClO4
Mol. Mass.226.613
SMILESOC(=O)C(=O)CC(=O)c1cccc(Cl)c1