Reaction Details
TargetKynurenine 3-monooxygenase
LigandBDBM50061907
Substrate/Competitorn/a
Meas. Tech.ChEMBL_91745 (CHEMBL700046)
IC50 8000±n/a nM
Citation Drysdale, MJHind, SLJansen, MReinhard, JF Synthesis and SAR of 4-aryl-2-hydroxy-4-oxobut-2-enoic acids and esters and 2-amino-4-aryl-4-oxobut-2-enoic acids and esters: potent inhibitors of kynurenine-3-hydroxylase as potential neuroprotective agents. J Med Chem43:123-7 (2000) Kynurenine 3-monooxygenase
Name:Kynurenine 3-monooxygenase
Type:PROTEIN
Mol. Mass.:54371.88
Organism:Rattus norvegicus
Description:ChEMBL_1487468
Residue:478
BDBM50061907
NameBDBM50061907
Synonyms:(+/-)-2-Amino-4-(3-nitro-phenyl)-4-oxo-butyric acid[(+/-)-m-nicotinylbenzoylalanine] CHEMBL23983 | meta-nitrobenzoyl)alanine
TypeSmall organic molecule
Emp. Form.C10H10N2O5
Mol. Mass.238.1968
SMILESNC(CC(=O)c1cccc(c1)[N+]([O-])=O)C(O)=O