Reaction Details
TargetKynurenine 3-monooxygenase
LigandBDBM50083949
Substrate/Competitorn/a
Meas. Tech.ChEMBL_91745 (CHEMBL700046)
IC50 1900±n/a nM
Citation Drysdale, MJHind, SLJansen, MReinhard, JF Synthesis and SAR of 4-aryl-2-hydroxy-4-oxobut-2-enoic acids and esters and 2-amino-4-aryl-4-oxobut-2-enoic acids and esters: potent inhibitors of kynurenine-3-hydroxylase as potential neuroprotective agents. J Med Chem43:123-7 (2000) Kynurenine 3-monooxygenase
Name:Kynurenine 3-monooxygenase
Type:PROTEIN
Mol. Mass.:54371.88
Organism:Rattus norvegicus
Description:ChEMBL_1487468
Residue:478
BDBM50083949
NameBDBM50083949
Synonyms:4-(3-Chloro-phenyl)-2-hydroxy-4-oxo-but-2-enoic acid methyl ester | CHEMBL23585
TypeSmall organic molecule
Emp. Form.C11H9ClO4
Mol. Mass.240.64
SMILESCOC(=O)C(=O)CC(=O)c1cccc(Cl)c1