Reaction Details
TargetProthrombin
LigandBDBM50083963
Substrate/Competitorn/a
Meas. Tech.ChEBML_208342
Ki 4.7±n/a nM
Citation Soll, RMLu, TTomczuk, BIllig, CRFedde, CEisennagel, SBone, RMurphy, LSpurlino, JSalemme, FR Amidinohydrazones as guanidine bioisosteres: application to a new class of potent, selective and orally bioavailable, non-amide-based small-molecule thrombin inhibitors. Bioorg Med Chem Lett10:1-4 (2000) Prothrombin
Name:Prothrombin
Type:Protein
Mol. Mass.:70029.57
Organism:Homo sapiens (Human)
Description:P00734
Residue:622
BDBM50083963
NameBDBM50083963
Synonyms:3-[((3E)-3-{[(E)-amino(imino)methyl]hydrazono}propyl)oxy]-5-methylphenyl quinolin-8-ylsulfonate | CHEMBL128443
TypeSmall organic molecule
Emp. Form.C20H21N5O4S
Mol. Mass.427.477
SMILESCc1cc(OCCC=NNC(N)=N)cc(OS(=O)(=O)c2cccc3cccnc23)c1