Reaction Details
TargetMelanin-concentrating hormone receptor 1
LigandBDBM50169374
Substrate/Competitorn/a
Meas. Tech.ChEMBL_1908152 (CHEMBL4410510)
IC50 0.410000±n/a nM
Citation Helal, MAChittiboyina, AGAvery, MA Identification of a new small molecule chemotype of Melanin Concentrating Hormone Receptor-1 antagonists using pharmacophore-based virtual screening. Bioorg Med Chem Lett29:0 (2019) 
 
Melanin-concentrating hormone receptor 1
Name:Melanin-concentrating hormone receptor 1
Type:G Protein-Coupled Receptor (GPCR)
Mol. Mass.:45976.27
Organism:Homo sapiens (Human)
Description:Membranes from CHO-K1 cells stably expressing human MCH1R were used in assays.
Residue:422
BDBM50169374
NameBDBM50169374
Synonyms:1-[4-(3'-Cyano-biphenyl-4-yl)-1-(2-methoxy-ethyl)-piperidin-4-ylmethyl]-3-(3,5-dichloro-phenyl)-urea | CHEMBL178997
TypeSmall organic molecule
Emp. Form.C29H30Cl2N4O2
Mol. Mass.537.48
SMILESCOCCN1CCC(CNC(=O)Nc2cc(Cl)cc(Cl)c2)(CC1)c1ccc(cc1)-c1cccc(c1)C#N