Reaction Details
TargetGlutamate receptor ionotropic, NMDA 1
LigandBDBM50084062
Substrate/Competitorn/a
Meas. Tech.ChEBML_140685
IC50 8±n/a nM
Citation Ametamey, SMKokic, MCarrey-Rémy, NBläuenstein, PWillmann, MBischoff, SSchmutz, MSchubiger, PAAuberson, YP Synthesis, radiolabelling and biological characterization of (D)-7-iodo-N-(1-phosphonoethyl)-5-aminomethylquinoxaline-2,3-dione, a glycine-binding site antagonist of NMDA receptors. Bioorg Med Chem Lett10:75-8 (2000) Glutamate receptor ionotropic, NMDA 1
Name:Glutamate receptor ionotropic, NMDA 1
Type:Enzyme Catalytic Domain
Mol. Mass.:105397.81
Organism:Homo sapiens (Human)
Description:Q05586
Residue:938
BDBM50084062
NameBDBM50084062
Synonyms:CHEMBL354295 | {(S)-1-[(7-Iodo-2,3-dioxo-1,2,3,4-tetrahydro-quinoxalin-5-ylmethyl)-amino]-ethyl}-phosphonic acid
TypeSmall organic molecule
Emp. Form.C11H13IN3O5P
Mol. Mass.425.1163
SMILESC[C@@H](NCc1cc(I)cc2[nH]c(=O)c(=O)[nH]c12)P(O)(O)=O