Reaction Details
TargetGlutamate receptor ionotropic, NMDA 1
LigandBDBM50084064
Substrate/Competitorn/a
Meas. Tech.ChEBML_140685
IC50 6±n/a nM
Citation Ametamey, SMKokic, MCarrey-Rémy, NBläuenstein, PWillmann, MBischoff, SSchmutz, MSchubiger, PAAuberson, YP Synthesis, radiolabelling and biological characterization of (D)-7-iodo-N-(1-phosphonoethyl)-5-aminomethylquinoxaline-2,3-dione, a glycine-binding site antagonist of NMDA receptors. Bioorg Med Chem Lett10:75-8 (2000) Glutamate receptor ionotropic, NMDA 1
Name:Glutamate receptor ionotropic, NMDA 1
Type:Enzyme Catalytic Domain
Mol. Mass.:105397.81
Organism:Homo sapiens (Human)
Description:Q05586
Residue:938
BDBM50084064
NameBDBM50084064
Synonyms:CHEMBL167952 | {(S)-1-[(7-Chloro-2,3-dioxo-1,2,3,4-tetrahydro-quinoxalin-5-ylmethyl)-amino]-ethyl}-phosphonic acid
TypeSmall organic molecule
Emp. Form.C11H13ClN3O5P
Mol. Mass.333.665
SMILESC[C@@H](NCc1cc(Cl)cc2[nH]c(=O)c(=O)[nH]c12)P(O)(O)=O