Reaction Details
TargetReverse transcriptase/RNaseH
LigandBDBM50206060
Substrate/Competitorn/a
Meas. Tech.ChEBML_195059
IC50 100±n/a nM
Citation Dong, YVenkatachalam, TKNarla, RKTrieu, VNSudbeck, EAUckun, FM Antioxidant function of phenethyl-5-bromo-pyridyl thiourea compounds with potent anti-HIV activity. Bioorg Med Chem Lett10:87-90 (2000) Reverse transcriptase/RNaseH
Name:Reverse transcriptase/RNaseH
Type:PROTEIN
Mol. Mass.:65229.15
Organism:Human immunodeficiency virus 1
Description:ChEMBL_1473730
Residue:566
BDBM50206060
NameBDBM50206060
Synonyms:1-(2,5-dimethoxyphenethyl)-3-(5-bromopyridin-2-yl)thiourea 1-(5-bromopyridin-2-yl)-3-(2,5-dimethoxyphenethyl)thiourea HI-236
TypeSmall organic molecule
Emp. Form.C16H18BrN3O2S
Mol. Mass.396.302
SMILESCOc1ccc(OC)c(CCNC(=S)Nc2ccc(Br)cn2)c1