Reaction Details
TargetReverse transcriptase/RNaseH
LigandBDBM50084092
Substrate/Competitorn/a
Meas. Tech.ChEBML_195059
IC50>100000±n/a nM
Citation Dong, YVenkatachalam, TKNarla, RKTrieu, VNSudbeck, EAUckun, FM Antioxidant function of phenethyl-5-bromo-pyridyl thiourea compounds with potent anti-HIV activity. Bioorg Med Chem Lett10:87-90 (2000) Reverse transcriptase/RNaseH
Name:Reverse transcriptase/RNaseH
Type:PROTEIN
Mol. Mass.:65229.15
Organism:Human immunodeficiency virus 1
Description:ChEMBL_1473730
Residue:566
BDBM50084092
NameBDBM50084092
Synonyms:2-Benzyl-1-(5-bromo-pyridin-2-yl)-3-[2-(2-chloro-phenyl)-ethyl]-isothiourea | CHEMBL170861
TypeSmall organic molecule
Emp. Form.C21H19BrClN3S
Mol. Mass.460.818
SMILESClc1ccccc1CCNC(SCc1ccccc1)=Nc1ccc(Br)cn1