Reaction Details
TargetTrypanothione reductase
LigandBDBM83820
Substrate/Competitorn/a
Meas. Tech.ChEMBL_211976 (CHEMBL878025)
Ki 38000±n/a nM
Citation Bonse, SSantelli-Rouvier, CBarbe, JKrauth-Siegel, RL Inhibition of Trypanosoma cruzi trypanothione reductase by acridines: kinetic studies and structure-activity relationships. J Med Chem42:5448-54 (2000) Trypanothione reductase
Name:Trypanothione reductase
Type:Homodimer; oxidoreductase
Mol. Mass.:53868.26
Organism:Trypanosoma cruzi
Description:n/a
Residue:492
BDBM83820
NameBDBM83820
Synonyms:9-Amino-acridinium MLS001241050 acridin-10-ium-9-amine;chloride cid_24892261
TypeSmall organic molecule
Emp. Form.C13H11N2
Mol. Mass.195.2393
SMILESNc1c2ccccc2[nH+]c2ccccc12