Reaction Details
TargetTyrosinase
LigandBDBM50205814
Substrate/Competitorn/a
Meas. Tech.ChEMBL_1908910 (CHEMBL4411356)
Ki 128000±n/a nM
Citation Pillaiyar, TNamasivayam, VManickam, MJung, SH Inhibitors of Melanogenesis: An Updated Review. J Med Chem61:7395-7418 (2018) 
 
Tyrosinase
Name:Tyrosinase
Type:Protein
Mol. Mass.:60388.08
Organism:Homo sapiens (Human)
Description:P14679
Residue:529
BDBM50205814
NameBDBM50205814
Synonyms:CHEMBL3898657
TypeSmall organic molecule
Emp. Form.C5H5NO2
Mol. Mass.111.0987
SMILESOc1cccc[n+]1[O-]