Reaction Details
TargetTyrosinase
LigandBDBM50205815
Substrate/Competitorn/a
Meas. Tech.ChEMBL_1908914 (CHEMBL4411360)
Ki 1020±n/a nM
Citation Pillaiyar, TNamasivayam, VManickam, MJung, SH Inhibitors of Melanogenesis: An Updated Review. J Med Chem61:7395-7418 (2018) 
 
Tyrosinase
Name:Tyrosinase
Type:Protein
Mol. Mass.:60388.08
Organism:Homo sapiens (Human)
Description:P14679
Residue:529
BDBM50205815
NameBDBM50205815
Synonyms:CHEMBL3907670
TypeSmall organic molecule
Emp. Form.C14H9NO5
Mol. Mass.271.225
SMILESOc1cccc2O\C(=C/c3ccc(=O)n(O)c3)C(=O)c12