Reaction Details
TargetCysteinyl leukotriene receptor 1
LigandBDBM50084801
Substrate/Competitorn/a
Meas. Tech.ChEMBL_52222 (CHEMBL663972)
Ki 1.05±n/a nM
Citation Palomer, APascual, JCabré, FGarcía, MLMauleón, D Derivation of pharmacophore and CoMFA models for leukotriene D(4) receptor antagonists of the quinolinyl(bridged)aryl series. J Med Chem43:392-400 (2000) Cysteinyl leukotriene receptor 1
Name:Cysteinyl leukotriene receptor 1
Type:Enzyme Catalytic Domain
Mol. Mass.:39007.58
Organism:GUINEA PIG
Description:Leukotriene D4 0 GUINEA PIG::Q2NNR5
Residue:340
BDBM50084801
NameBDBM50084801
Synonyms:4-(2-{[7-(Quinolin-2-ylmethoxy)-naphthalene-2-carbonyl]-amino}-ethyl)-benzoic acid | CHEMBL132162
TypeSmall organic molecule
Emp. Form.C30H24N2O4
Mol. Mass.476.5226
SMILESOC(=O)c1ccc(CCNC(=O)c2ccc3ccc(OCc4ccc5ccccc5n4)cc3c2)cc1