Reaction Details
TargetProthrombin
LigandBDBM50085388
Substrate/Competitorn/a
Meas. Tech.ChEBML_48309
Ki>4000±n/a nM
Citation Gong, YPauls, HWSpada, APCzekaj, MLiang, GChu, VColussi, DJBrown, KDGao, J Amido-(propyl and allyl)-hydroxybenzamidines: development of achiral inhibitors of factor Xa. Bioorg Med Chem Lett10:217-21 (2000) Prothrombin
Name:Prothrombin
Type:Protein
Mol. Mass.:70029.57
Organism:Homo sapiens (Human)
Description:P00734
Residue:622
BDBM50085388
NameBDBM50085388
Synonyms:3'-Sulfamoyl-biphenyl-4-carboxylic acid [3-(5-carbamimidoyl-2-hydroxy-phenyl)-allyl]-amide | CHEMBL71418
TypeSmall organic molecule
Emp. Form.C23H22N4O4S
Mol. Mass.450.51
SMILESNC(=N)c1ccc(O)c(\C=C\CNC(=O)c2ccc(cc2)-c2cccc(c2)S(N)(=O)=O)c1