Reaction Details
TargetSerine protease 1
LigandBDBM50085389
Substrate/Competitorn/a
Meas. Tech.ChEBML_213076
Ki 1400±n/a nM
Citation Gong, YPauls, HWSpada, APCzekaj, MLiang, GChu, VColussi, DJBrown, KDGao, J Amido-(propyl and allyl)-hydroxybenzamidines: development of achiral inhibitors of factor Xa. Bioorg Med Chem Lett10:217-21 (2000) Serine protease 1
Name:Serine protease 1
Type:Enzyme
Mol. Mass.:26557.80
Organism:Homo sapiens (Human)
Description:P07477
Residue:247
BDBM50085389
NameBDBM50085389
Synonyms:3-Oxo-2,3-dihydro-thieno[3,2-c]pyridazine-6-carboxylic acid[(E)-3-(5-carbamimidoyl-2-hydroxy-phenyl)-allyl]-amide | CHEMBL73774
TypeSmall organic molecule
Emp. Form.C17H15N5O3S
Mol. Mass.369.398
SMILESNC(=N)c1ccc(O)c(C=CCNC(=O)c2cc3n[nH]c(=O)cc3s2)c1