Reaction Details
TargetSerine protease 1
LigandBDBM50085403
Substrate/Competitorn/a
Meas. Tech.ChEBML_213076
Ki>2900±n/a nM
Citation Gong, YPauls, HWSpada, APCzekaj, MLiang, GChu, VColussi, DJBrown, KDGao, J Amido-(propyl and allyl)-hydroxybenzamidines: development of achiral inhibitors of factor Xa. Bioorg Med Chem Lett10:217-21 (2000) Serine protease 1
Name:Serine protease 1
Type:Enzyme
Mol. Mass.:26557.80
Organism:Homo sapiens (Human)
Description:P07477
Residue:247
BDBM50085403
NameBDBM50085403
Synonyms:6-Chloro-benzo[b]thiophene-2-carboxylic acid [3-(5-carbamimidoyl-2-hydroxy-phenyl)-propyl]-amide | CHEMBL70660
TypeSmall organic molecule
Emp. Form.C19H18ClN3O2S
Mol. Mass.387.883
SMILESNC(=N)c1ccc(O)c(CCCNC(=O)c2cc3ccc(Cl)cc3s2)c1