Reaction Details
TargetCoagulation factor X
LigandBDBM50085399
Substrate/Competitorn/a
Meas. Tech.ChEBML_48998
Ki 61±n/a nM
Citation Gong, YPauls, HWSpada, APCzekaj, MLiang, GChu, VColussi, DJBrown, KDGao, J Amido-(propyl and allyl)-hydroxybenzamidines: development of achiral inhibitors of factor Xa. Bioorg Med Chem Lett10:217-21 (2000) Coagulation factor X
Name:Coagulation factor X
Type:Enzyme
Mol. Mass.:54726.60
Organism:Homo sapiens (Human)
Description:n/a
Residue:488
BDBM50085399
NameBDBM50085399
Synonyms:4-tert-Butyl-N-[(E)-3-(5-carbamimidoyl-2-hydroxy-phenyl)-allyl]-benzamide | CHEMBL305425
TypeSmall organic molecule
Emp. Form.C21H25N3O2
Mol. Mass.351.4421
SMILESCC(C)(C)c1ccc(cc1)C(=O)NC\C=C\c1cc(ccc1O)C(N)=N