Reaction Details
TargetSerine protease 1
LigandBDBM50085396
Substrate/Competitorn/a
Meas. Tech.ChEBML_213076
Ki 1400±n/a nM
Citation Gong, YPauls, HWSpada, APCzekaj, MLiang, GChu, VColussi, DJBrown, KDGao, J Amido-(propyl and allyl)-hydroxybenzamidines: development of achiral inhibitors of factor Xa. Bioorg Med Chem Lett10:217-21 (2000) Serine protease 1
Name:Serine protease 1
Type:Enzyme
Mol. Mass.:26557.80
Organism:Homo sapiens (Human)
Description:P07477
Residue:247
BDBM50085396
NameBDBM50085396
Synonyms:Biphenyl-4,4'-dicarboxylic acid 4-amide 4'-{[3-(5-carbamimidoyl-2-hydroxy-phenyl)-allyl]-amide} | CHEMBL68486
TypeSmall organic molecule
Emp. Form.C24H22N4O3
Mol. Mass.414.4565
SMILESNC(=N)c1ccc(O)c(\C=C\CNC(=O)c2ccc(cc2)-c2ccc(cc2)C(N)=O)c1