Reaction Details
TargetProthrombin
LigandBDBM50085396
Substrate/Competitorn/a
Meas. Tech.ChEBML_48309
Ki 2900±n/a nM
Citation Gong, YPauls, HWSpada, APCzekaj, MLiang, GChu, VColussi, DJBrown, KDGao, J Amido-(propyl and allyl)-hydroxybenzamidines: development of achiral inhibitors of factor Xa. Bioorg Med Chem Lett10:217-21 (2000) Prothrombin
Name:Prothrombin
Type:Protein
Mol. Mass.:70029.57
Organism:Homo sapiens (Human)
Description:P00734
Residue:622
BDBM50085396
NameBDBM50085396
Synonyms:Biphenyl-4,4'-dicarboxylic acid 4-amide 4'-{[3-(5-carbamimidoyl-2-hydroxy-phenyl)-allyl]-amide} | CHEMBL68486
TypeSmall organic molecule
Emp. Form.C24H22N4O3
Mol. Mass.414.4565
SMILESNC(=N)c1ccc(O)c(\C=C\CNC(=O)c2ccc(cc2)-c2ccc(cc2)C(N)=O)c1