Reaction Details
TargetProthrombin
LigandBDBM50085391
Substrate/Competitorn/a
Meas. Tech.ChEBML_48309
Ki>4000±n/a nM
Citation Gong, YPauls, HWSpada, APCzekaj, MLiang, GChu, VColussi, DJBrown, KDGao, J Amido-(propyl and allyl)-hydroxybenzamidines: development of achiral inhibitors of factor Xa. Bioorg Med Chem Lett10:217-21 (2000) Prothrombin
Name:Prothrombin
Type:Protein
Mol. Mass.:70029.57
Organism:Homo sapiens (Human)
Description:P00734
Residue:622
BDBM50085391
NameBDBM50085391
Synonyms:CHEMBL302064 | N-[3-(5-Carbamimidoyl-2-hydroxy-phenyl)-propyl]-4-pyridin-3-yl-benzamide
TypeSmall organic molecule
Emp. Form.C22H22N4O2
Mol. Mass.374.4357
SMILESNC(=N)c1ccc(O)c(CCCNC(=O)c2ccc(cc2)-c2cccnc2)c1