Reaction Details
TargetCoagulation factor X
LigandBDBM50085404
Substrate/Competitorn/a
Meas. Tech.ChEBML_48998
Ki 131±n/a nM
Citation Gong, YPauls, HWSpada, APCzekaj, MLiang, GChu, VColussi, DJBrown, KDGao, J Amido-(propyl and allyl)-hydroxybenzamidines: development of achiral inhibitors of factor Xa. Bioorg Med Chem Lett10:217-21 (2000) Coagulation factor X
Name:Coagulation factor X
Type:Enzyme
Mol. Mass.:54726.60
Organism:Homo sapiens (Human)
Description:n/a
Residue:488
BDBM50085404
NameBDBM50085404
Synonyms:5-Pyridin-2-yl-thiophene-2-carboxylic acid [3-(5-carbamimidoyl-2-hydroxy-phenyl)-propyl]-amide | CHEMBL68101
TypeSmall organic molecule
Emp. Form.C20H20N4O2S
Mol. Mass.380.463
SMILESNC(=N)c1ccc(O)c(CCCNC(=O)c2ccc(s2)-c2ccccn2)c1