Reaction Details
TargetSerine protease 1
LigandBDBM50085405
Substrate/Competitorn/a
Meas. Tech.ChEBML_213076
Ki 1500±n/a nM
Citation Gong, YPauls, HWSpada, APCzekaj, MLiang, GChu, VColussi, DJBrown, KDGao, J Amido-(propyl and allyl)-hydroxybenzamidines: development of achiral inhibitors of factor Xa. Bioorg Med Chem Lett10:217-21 (2000) Serine protease 1
Name:Serine protease 1
Type:Enzyme
Mol. Mass.:26557.80
Organism:Homo sapiens (Human)
Description:P07477
Residue:247
BDBM50085405
NameBDBM50085405
Synonyms:2'-Sulfamoyl-biphenyl-4-carboxylic acid [3-(5-carbamimidoyl-2-hydroxy-phenyl)-allyl]-amide | CHEMBL308400
TypeSmall organic molecule
Emp. Form.C23H22N4O4S
Mol. Mass.450.51
SMILESNC(=N)c1ccc(O)c(\C=C\CNC(=O)c2ccc(cc2)-c2ccccc2S(N)(=O)=O)c1