Reaction Details
Target3-oxo-5-alpha-steroid 4-dehydrogenase 1
LigandBDBM50032771
Substrate/Competitorn/a
Meas. Tech.ChEBML_205057
IC50 0.500000±n/a nM
Citation Guarna, AOcchiato, EGScarpi, DZorn, CDanza, GComerci, AMancina, RSerio, M Synthesis of 8-chloro-benzo[c]quinolizin-3-ones as potent and selective inhibitors of human steroid 5alpha-reductase 1. Bioorg Med Chem Lett10:353-6 (2000) 3-oxo-5-alpha-steroid 4-dehydrogenase 1
Name:3-oxo-5-alpha-steroid 4-dehydrogenase 1
Type:Enzyme
Mol. Mass.:29472.80
Organism:Homo sapiens (Human)
Description:P18405
Residue:259
BDBM50032771
NameBDBM50032771
Synonyms:(4aR,6aR,10S)-7-(1,5-Dimethyl-hexyl)-1,4a,6a,10-tetramethyl-hexadecahydro-indeno[5,4-f]quinolin-2-one CHEMBL25448 | MK-386
TypeSmall organic molecule
Emp. Form.C28H49NO
Mol. Mass.415.6948
SMILESCC(C)CCCC(C)C1CCC2C3[C@@H](C)CC4N(C)C(=O)CC[C@]4(C)C3CC[C@]12C