Reaction Details
TargetGonadotropin-releasing hormone receptor
LigandBDBM50085795
Substrate/Competitorn/a
Meas. Tech.ChEMBL_71743 (CHEMBL680265)
Ki 2.3±n/a nM
Citation Rivier, JEJiang, GStruthers, RSKoerber, SCPorter, JCervini, LAKirby, DACraig, AGRivier, CL Design of potent dicyclic (1-5/4-10) gonadotropin releasing hormone (GnRH) antagonists. J Med Chem43:807-18 (2000) Gonadotropin-releasing hormone receptor
Name:Gonadotropin-releasing hormone receptor
Type:PROTEIN
Mol. Mass.:37767.60
Organism:Rattus norvegicus
Description:ChEMBL_1335047
Residue:327
BDBM50085795
NameBDBM50085795
Synonyms:CHEMBL439470 | Gonadotropin Releasing Hormone analogue
TypeSmall organic molecule
Emp. Form.C70H90ClN15O12
Mol. Mass.1369.01
SMILESCC(C)C[C@@H]1NC(=O)[C@@H](Cc2ccc3ccccc3c2)NC(=O)[C@H](CCCNC(N)=N)NC(=O)[C@H](C)NC(=O)[C@H](CC(=O)NCCCC[C@H](NC1=O)C(=O)N1CCC[C@H]1C(=O)N[C@@H](C)C(N)=O)NC(=O)[C@H](Cc1ccc(Cl)cc1)NC(=O)[C@@H](Cc1ccc2ccccc2c1)NC(C)=O