Reaction Details
TargetGonadotropin-releasing hormone receptor
LigandBDBM50085807
Substrate/Competitorn/a
Meas. Tech.ChEMBL_71743 (CHEMBL680265)
Ki 0.12±n/a nM
Citation Rivier, JEJiang, GStruthers, RSKoerber, SCPorter, JCervini, LAKirby, DACraig, AGRivier, CL Design of potent dicyclic (1-5/4-10) gonadotropin releasing hormone (GnRH) antagonists. J Med Chem43:807-18 (2000) Gonadotropin-releasing hormone receptor
Name:Gonadotropin-releasing hormone receptor
Type:PROTEIN
Mol. Mass.:37767.60
Organism:Rattus norvegicus
Description:ChEMBL_1335047
Residue:327
BDBM50085807
NameBDBM50085807
Synonyms:CHEMBL425966 | Gonadotropin Releasing Hormone analogue
TypeSmall organic molecule
Emp. Form.C67H87FN18O14
Mol. Mass.1387.5183
SMILESCC(C)C[C@@H]1NC(=O)[C@H](CCCNC(N)=N)NC(=O)[C@@H]2CCC(=O)NCC(=O)NCC[C@@H](NC1=O)C(=O)N1CCC[C@H]1C(=O)NC(CNC(=O)C[C@H](NC(=O)[C@@H](Cc1cccnc1)NC(=O)[C@H](Cc1ccc(F)cc1)NC(=O)[C@@H](Cc1ccc3ccccc3c1)NC(C)=O)C(=O)N2)C(N)=O