Reaction Details
TargetProstaglandin E2 receptor EP1 subtype
LigandBDBM50085915
Substrate/Competitorn/a
Meas. Tech.ChEMBL_158172 (CHEMBL766135)
IC50>10000±n/a nM
Citation Wang, YWos, JADirr, MJSoper, DLdeLong, MAMieling, GEDe, BAmburgey, JSSuchanek, EGTaylor, CJ Design and synthesis of 13,14-dihydro prostaglandin F(1alpha) analogues as potent and selective ligands for the human FP receptor. J Med Chem43:945-52 (2000) Prostaglandin E2 receptor EP1 subtype
Name:Prostaglandin E2 receptor EP1 subtype
Type:Enzyme
Mol. Mass.:41834.57
Organism:Homo sapiens (Human)
Description:P34995
Residue:402
BDBM50085915
NameBDBM50085915
Synonyms:7-{3,5-Dihydroxy-2-[3-hydroxy-4-(thiazol-2-ylsulfanyl)-butyl]-cyclopentyl}-heptanoic acid | CHEMBL173811
TypeSmall organic molecule
Emp. Form.C19H31NO5S2
Mol. Mass.417.583
SMILESOC(CC[C@H]1[C@H](O)C[C@H](O)[C@@H]1CCCCCCC(O)=O)CSc1nccs1