Reaction Details
TargetProstacyclin receptor
LigandBDBM50085913
Substrate/Competitorn/a
Meas. Tech.ChEMBL_158006 (CHEMBL768432)
IC50>10000±n/a nM
Citation Wang, YWos, JADirr, MJSoper, DLdeLong, MAMieling, GEDe, BAmburgey, JSSuchanek, EGTaylor, CJ Design and synthesis of 13,14-dihydro prostaglandin F(1alpha) analogues as potent and selective ligands for the human FP receptor. J Med Chem43:945-52 (2000) Prostacyclin receptor
Name:Prostacyclin receptor
Type:G Protein-Coupled Receptor (GPCR)
Mol. Mass.:40968.22
Organism:Homo sapiens (Human)
Description:The membranes prepared from human platelet were used in binding assay.
Residue:386
BDBM50085913
NameBDBM50085913
Synonyms:7-{2-[4-(3-Fluoro-phenylsulfanyl)-3-hydroxy-butyl]-3,5-dihydroxy-cyclopentyl}-heptanoic acid | CHEMBL173499
TypeSmall organic molecule
Emp. Form.C22H33FO5S
Mol. Mass.428.558
SMILESOC(CC[C@H]1[C@H](O)C[C@H](O)[C@@H]1CCCCCCC(O)=O)CSc1cccc(F)c1