Reaction Details
TargetProstaglandin E2 receptor EP2 subtype
LigandBDBM50085914
Substrate/Competitorn/a
Meas. Tech.ChEMBL_158298 (CHEMBL763183)
IC50 4900±n/a nM
Citation Wang, YWos, JADirr, MJSoper, DLdeLong, MAMieling, GEDe, BAmburgey, JSSuchanek, EGTaylor, CJ Design and synthesis of 13,14-dihydro prostaglandin F(1alpha) analogues as potent and selective ligands for the human FP receptor. J Med Chem43:945-52 (2000) Prostaglandin E2 receptor EP2 subtype
Name:Prostaglandin E2 receptor EP2 subtype
Type:Enzyme
Mol. Mass.:39775.71
Organism:Homo sapiens (Human)
Description:P43116
Residue:358
BDBM50085914
NameBDBM50085914
Synonyms:7-[(1R,2R,3R,5S)-3,5-Dihydroxy-2-((S)-3-hydroxy-octyl)-cyclopentyl]-heptanoic acid CHEMBL36817
TypeSmall organic molecule
Emp. Form.C20H38O5
Mol. Mass.358.5127
SMILESCCCCC[C@H](O)CC[C@H]1[C@H](O)C[C@H](O)[C@@H]1CCCCCCC(O)=O