Reaction Details
TargetProstaglandin E2 receptor EP2 subtype
LigandBDBM50085919
Substrate/Competitorn/a
Meas. Tech.ChEMBL_158298 (CHEMBL763183)
IC50 1300±n/a nM
Citation Wang, YWos, JADirr, MJSoper, DLdeLong, MAMieling, GEDe, BAmburgey, JSSuchanek, EGTaylor, CJ Design and synthesis of 13,14-dihydro prostaglandin F(1alpha) analogues as potent and selective ligands for the human FP receptor. J Med Chem43:945-52 (2000) Prostaglandin E2 receptor EP2 subtype
Name:Prostaglandin E2 receptor EP2 subtype
Type:Enzyme
Mol. Mass.:39775.71
Organism:Homo sapiens (Human)
Description:P43116
Residue:358
BDBM50085919
NameBDBM50085919
Synonyms:7-{3,5-Dihydroxy-2-[3-hydroxy-4-(thiophen-2-ylsulfanyl)-butyl]-cyclopentyl}-heptanoic acid | CHEMBL369797
TypeSmall organic molecule
Emp. Form.C20H32O5S2
Mol. Mass.416.595
SMILESOC(CC[C@H]1[C@H](O)C[C@H](O)[C@@H]1CCCCCCC(O)=O)CSc1cccs1