Reaction Details
TargetProstaglandin F2-alpha receptor
LigandBDBM50085917
Substrate/Competitorn/a
Meas. Tech.ChEMBL_158455 (CHEMBL763259)
IC50 570±n/a nM
Citation Wang, YWos, JADirr, MJSoper, DLdeLong, MAMieling, GEDe, BAmburgey, JSSuchanek, EGTaylor, CJ Design and synthesis of 13,14-dihydro prostaglandin F(1alpha) analogues as potent and selective ligands for the human FP receptor. J Med Chem43:945-52 (2000) Prostaglandin F2-alpha receptor
Name:Prostaglandin F2-alpha receptor
Type:Enzyme
Mol. Mass.:40072.29
Organism:Homo sapiens (Human)
Description:P43088
Residue:359
BDBM50085917
NameBDBM50085917
Synonyms:7-[(1R,2R,3R,5S)-3,5-Dihydroxy-2-((R)-3-hydroxy-5-phenyl-pentyl)-cyclopentyl]-heptanoic acid CHEMBL290969
TypeSmall organic molecule
Emp. Form.C23H36O5
Mol. Mass.392.5289
SMILESO[C@H](CC[C@H]1[C@H](O)C[C@H](O)[C@@H]1CCCCCCC(O)=O)CCc1ccccc1