Reaction Details
TargetProstaglandin E2 receptor EP2 subtype
LigandBDBM50085911
Substrate/Competitorn/a
Meas. Tech.ChEMBL_158298 (CHEMBL763183)
IC50 6700±n/a nM
Citation Wang, YWos, JADirr, MJSoper, DLdeLong, MAMieling, GEDe, BAmburgey, JSSuchanek, EGTaylor, CJ Design and synthesis of 13,14-dihydro prostaglandin F(1alpha) analogues as potent and selective ligands for the human FP receptor. J Med Chem43:945-52 (2000) Prostaglandin E2 receptor EP2 subtype
Name:Prostaglandin E2 receptor EP2 subtype
Type:Enzyme
Mol. Mass.:39775.71
Organism:Homo sapiens (Human)
Description:P43116
Residue:358
BDBM50085911
NameBDBM50085911
Synonyms:7-{(1R,2R,3R,5S)-2-[(R)-4-(3-Chloro-phenoxy)-3-hydroxy-butyl]-3,5-dihydroxy-cyclopentyl}-heptanoic acid CHEMBL36041
TypeSmall organic molecule
Emp. Form.C22H33ClO6
Mol. Mass.428.947
SMILESO[C@H](CC[C@H]1[C@H](O)C[C@H](O)[C@@H]1CCCCCCC(O)=O)COc1cccc(Cl)c1