Reaction Details
Target5-hydroxytryptamine receptor 1A
LigandBDBM34142
Substrate/Competitorn/a
Meas. Tech.ChEMBL_934 (CHEMBL616299)
Ki 170±n/a nM
Citation Glennon, RALee, MRangisetty, JBDukat, MRoth, BLSavage, JEMcBride, ARauser, LHufeisen, SLee, DK 2-Substituted tryptamines: agents with selectivity for 5-HT(6) serotonin receptors. J Med Chem43:1011-8 (2000) 5-hydroxytryptamine receptor 1A
Name:5-hydroxytryptamine receptor 1A
Type:n/a
Mol. Mass.:46122.49
Organism:Homo sapiens (Human)
Description:n/a
Residue:422
BDBM34142
NameBDBM34142
Synonyms:2-ethyl-5-methoxy-N,N-dimethyltryptamine EDMT [2-(2-ethyl-5-methoxy-1H-indol-3-yl)ethyl]dimethylamine, 6
TypeSmall organic molecule
Emp. Form.C15H22N2O
Mol. Mass.246.348
SMILESCCc1[nH]c2ccc(OC)cc2c1CCN(C)C