Reaction Details
Target5-hydroxytryptamine receptor 6
LigandBDBM50014946
Substrate/Competitorn/a
Meas. Tech.ChEMBL_3619 (CHEMBL618122)
Ki 98±n/a nM
Citation Glennon, RALee, MRangisetty, JBDukat, MRoth, BLSavage, JEMcBride, ARauser, LHufeisen, SLee, DK 2-Substituted tryptamines: agents with selectivity for 5-HT(6) serotonin receptors. J Med Chem43:1011-8 (2000) 5-hydroxytryptamine receptor 6
Name:5-hydroxytryptamine receptor 6
Type:G Protein-Coupled Receptor (GPCR)
Mol. Mass.:46968.43
Organism:Homo sapiens (Human)
Description:P50406
Residue:440
BDBM50014946
NameBDBM50014946
Synonyms:2-(5-Methoxy-2-methyl-1H-indol-3-yl)-ethylamine CHEMBL268800
TypeSmall organic molecule
Emp. Form.C12H16N2O
Mol. Mass.204.2682
SMILESCOc1ccc2[nH]c(C)c(CCN)c2c1