Reaction Details
Target5-hydroxytryptamine receptor 7
LigandBDBM50085972
Substrate/Competitorn/a
Meas. Tech.ChEMBL_3695 (CHEMBL620829)
Ki 145±n/a nM
Citation Glennon, RALee, MRangisetty, JBDukat, MRoth, BLSavage, JEMcBride, ARauser, LHufeisen, SLee, DK 2-Substituted tryptamines: agents with selectivity for 5-HT(6) serotonin receptors. J Med Chem43:1011-8 (2000) 5-hydroxytryptamine receptor 7
Name:5-hydroxytryptamine receptor 7
Type:G Protein-Coupled Receptor (GPCR)
Mol. Mass.:53573.08
Organism:Homo sapiens (Human)
Description:P34969
Residue:479
BDBM50085972
NameBDBM50085972
Synonyms:CHEMBL7143 [2-(5-Methoxy-2-methyl-1H-indol-3-yl)-ethyl]-dimethyl-amine (C2H2O) | [2-(5-Methoxy-2-methyl-1H-indol-3-yl)-ethyl]-dimethyl-ammonium
TypeSmall organic molecule
Emp. Form.C14H20N2O
Mol. Mass.232.3214
SMILESCOc1ccc2[nH]c(C)c(CCN(C)C)c2c1