Reaction Details
Target5-hydroxytryptamine receptor 6
LigandBDBM50014406
Substrate/Competitorn/a
Meas. Tech.ChEMBL_3619 (CHEMBL618122)
Ki 46±n/a nM
Citation Glennon, RALee, MRangisetty, JBDukat, MRoth, BLSavage, JEMcBride, ARauser, LHufeisen, SLee, DK 2-Substituted tryptamines: agents with selectivity for 5-HT(6) serotonin receptors. J Med Chem43:1011-8 (2000) 5-hydroxytryptamine receptor 6
Name:5-hydroxytryptamine receptor 6
Type:G Protein-Coupled Receptor (GPCR)
Mol. Mass.:46968.43
Organism:Homo sapiens (Human)
Description:P50406
Residue:440
BDBM50014406
NameBDBM50014406
Synonyms:2-Me 5-HT 2-methyl-5-HT 3-(2-aminoethyl)-2-methyl-1H-indol-5-ol CHEMBL266591
TypeSmall organic molecule
Emp. Form.C11H14N2O
Mol. Mass.190.2417
SMILESCc1[nH]c2ccc(O)cc2c1CCN