Reaction Details
TargetD(2) dopamine receptor
LigandBDBM50530683
Substrate/Competitorn/a
Meas. Tech.ChEMBL_1913690 (CHEMBL4416273)
Ki 0.323594±n/a nM
Citation Fyfe, TJKellam, BSykes, DACapuano, BScammells, PJLane, JRCharlton, SJMistry, SN Structure-Kinetic Profiling of Haloperidol Analogues at the Human Dopamine D J Med Chem62:9488-9520 (2019) 
 
D(2) dopamine receptor
Name:D(2) dopamine receptor
Type:Cell-surface receptors
Mol. Mass.:50647.10
Organism:Homo sapiens (Human)
Description:P14416
Residue:443
BDBM50530683
NameBDBM50530683
Synonyms:CHEMBL4436610
TypeSmall organic molecule
Emp. Form.C22H23F4NO2
Mol. Mass.409.4171
SMILESOC1(CCN(CCCC(=O)c2ccc(F)cc2)CC1)c1ccc(cc1)C(F)(F)F